Home » RDBMS Server » Server Administration » oracle 10.2.0 on RHEL ES4 x64
oracle 10.2.0 on RHEL ES4 x64 [message #184134] Tue, 25 July 2006 08:44 Go to next message
matrix6
Messages: 2
Registered: July 2006
Junior Member
Has anyone done a successful installation of oracle 10.2.0 on RHEL ES4 x64?
I encounter three errors related to .mk files listed below and then a final Message:
"SEVERE: Abnormal program termination. An internal error has occured. Please provide the following files to Oracle Support :"

Can anyone please suggest...I am uploading the tarred log files for reference.

=1========================================================
INFO: make:
INFO: *** [ctxhx] Error 1
INFO:

INFO: End output from spawned process.
INFO: ----------------------------------
INFO: Exception thrown from action: make
Exception Name: MakefileException
Exception String: Error in invoking target 'install' of makefile '/u01/app/oracle/product/10.2.0/db_1/ctx/lib/ins_ctx.mk'. See '/u01/app/oracle/oraInventory/logs/installActions2006-07-24_04-50-34PM.log' for details.
Exception Severity: 1

=2=======================================================
INFO: make[1]: Leaving directory `/u01/app/oracle/product/10.2.0/db_1/sysman/lib'

INFO:
INFO: No such file or directory
collect2: ld returned 1 exit status
make[1]: *** [/u01/app/oracle/product/10.2.0/db_1/sysman/lib/libnmemso.so] Error 1
make: *** [libnmemso] Error 2

INFO: End output from spawned process.
INFO: ----------------------------------
INFO: Exception thrown from action: make
Exception Name: MakefileException
Exception String: Error in invoking target 'agent nmo nmb' of makefile '/u01/app/oracle/product/10.2.0/db_1/sysman/lib/ins_sysman.mk'. See '/u01/app/oracle/oraInventory/logs/installActions2006-07-24_04-50-34PM.log' for details.
Exception Severity: 1

=3===========================================================
INFO: make[1]:
INFO: *** [/u01/app/oracle/product/10.2.0/db_1/rdbms/lib/extproc32] Error 1
INFO:

INFO: make[1]: Leaving directory `/u01/app/oracle/product/10.2.0/db_1/rdbms/lib'

INFO: make:
INFO: *** [extproc32] Error 2
INFO:

INFO: End output from spawned process.
INFO: ----------------------------------
INFO: Exception thrown from action: make
Exception Name: MakefileException
Exception String: Error in invoking target 'all_no_orcl' of makefile '/u01/app/oracle/product/10.2.0/db_1/rdbms/lib/ins_rdbms.mk'. See '/u01/app/oracle/oraInventory/logs/installActions2006-07-24_04-50-34PM.log' for details.
Exception Severity: 1
=========================================================

  • Attachment: log.tar
    (Size: 730.00KB, Downloaded 398 times)
Re: oracle 10.2.0 on RHEL ES4 x64 [message #184137 is a reply to message #184134] Tue, 25 July 2006 08:46 Go to previous messageGo to next message
JRowbottom
Messages: 5933
Registered: June 2006
Location: Sunny North Yorkshire, ho...
Senior Member
Pardon the levity, but I think the message
Quote:

SEVERE: Abnormal program termination. An internal error has occured. Please provide the following files to Oracle Suppor

Tells you pretty much where this problem needs to go
Re: oracle 10.2.0 on RHEL ES4 x64 [message #184159 is a reply to message #184134] Tue, 25 July 2006 10:07 Go to previous messageGo to next message
matrix6
Messages: 2
Registered: July 2006
Junior Member
Are there any other suggestions?

thanks!
Re: oracle 10.2.0 on RHEL ES4 x64 [message #233219 is a reply to message #184159] Wed, 25 April 2007 04:07 Go to previous message
ihudak
Messages: 1
Registered: April 2007
Location: Ukraine
Junior Member

Install 32-bit versions of gcc, glibc and glibc-devel and this should help.
Previous Topic: drop a datafile
Next Topic: Localization settings
Goto Forum:
  


Current Time: Sat Dec 10 03:01:16 CST 2016

Total time taken to generate the page: 0.09759 seconds